[Openswan Users] 2.4.7rc3 compile issue

Mike Horn lists at caddisconsulting.com
Thu Nov 2 17:52:27 EST 2006


I ran into a compile issue with 2.4.7rc3 that didn't exist in 2.4.7rc2 for
my system.  This is on a FC5 system ( kernel with NETKEY) with gcc
4.1.1.  This is from a fresh 2.4.7rc3 downloaded today.  During 'make
programs'  I get the following failure:

spdb_struct.c: In function 'parse_isakmp_sa_body':
spdb_struct.c:951: error: 'oakley_group_desc' undeclared (first use in this
spdb_struct.c:951: error: (Each undeclared identifier is reported only once
spdb_struct.c:951: error: for each function it appears in.)
make[2]: *** [spdb_struct.o] Error 1
make[2]: Leaving directory `/opt/openswan-2.4.7rc3/programs/pluto'
make[1]: *** [programs] Error 1
make[1]: Leaving directory `/opt/openswan-2.4.7rc3/programs'
make: *** [programs] Error 1

Let me know if you need more information and if you want me to open a bug on


-------------- next part --------------
An HTML attachment was scrubbed...
URL: http://lists.openswan.org/pipermail/users/attachments/20061102/f66b508a/attachment.html 

More information about the Users mailing list