[Openswan Users] MODBUILDDIR required when building 2.4.6rc2

Mihajlo Cvetanović mac at netset.co.yu
Wed Jul 19 19:16:14 CEST 2006

Paul Wouters wrote:

>There was an error in Makefile.inc causing this, introduced in 2.4.6rc1. Please
>try 2.4.6rc3 which should appear on the web/ftp site in a few minutes.
2.4.6rc3 doesn't compile with this error:

/usr/src/openswan-2.4.6rc3/modobj26/aes/ipsec_alg_aes.c:82: error: 
expected ‘)’ before string constant
make[3]: *** [/usr/src/openswan-2.4.6rc3/modobj26/aes/ipsec_alg_aes.o] 
Error 1
make[2]: *** [_module_/usr/src/openswan-2.4.6rc3/modobj26] Error 2
make[2]: Leaving directory `/usr/src/linux-'
make[1]: *** [module26] Error 2
make[1]: Leaving directory `/usr/src/openswan-2.4.6rc3'
make: *** [module] Error 2

I looked at the line, but I'm unable to find anything unusual.

Those "release candidates" are compiled and tested before they are 
uploaded, aren't they? How then it won't compile on my FC5 :)

More information about the Users mailing list